BDBM76167 6-(1-piperidinylsulfonyl)-3H-1,3-benzoxazol-2-one::6-(Piperidine-1-sulfonyl)-3H-benzooxazol-2-one::6-piperidin-1-ylsulfonyl-3H-1,3-benzoxazol-2-one::6-piperidinosulfonyl-3H-1,3-benzoxazol-2-one::MLS000123468::SMR000124095::cid_921945
SMILES O=c1[nH]c2ccc(cc2o1)S(=O)(=O)N1CCCCC1
InChI Key InChIKey=JIKLIVODTUMFBV-UHFFFAOYSA-N
Data  4 IC50
  Tab Delimited (TSV)   2D SDfile   Computed 3D by Vconf -m prep SDfile
Find this compound or compounds like it in BindingDB:
Activity Spreadsheet -- Enzyme Inhibition Constant Data from BindingDB
Found 1 hit for monomerid = 76167
TargetIntestinal-type alkaline phosphatase 1(Rattus norvegicus (Rat))
Burnham Center For Chemical Genomics
Curated by PubChem BioAssay
LigandPNGBDBM76167(6-(1-piperidinylsulfonyl)-3H-1,3-benzoxazol-2-one ...)
Affinity DataIC50:  1.67E+3nM. Assay description: Data Source: Sanford-Burnham Center for Chemical Genomics (SBCCG) Source Affiliation: Sanford-Burnham Medical Research Institute (SBMRI, San Diego, C...
In DepthDetails PCBioAssay